Error Lnk2001 Unresolved External Symbol Static Function

RECOMMENDED: If you have Windows errors then we strongly recommend that you download and run this (Windows) Repair Tool.

Feb 22, 2007  · Hello, I am trying to use an alternative Sleep() function in C that has a better solution. (The solution of sleep() is only 15 ms). I need 1 ms. My teacher.

To perform arbitrary-precision arithmetic in C and C++ programs on Windows, I use GMP. In particular, I use MPIR, a Windows port of GMP. MPIR is a simple alternative.

Xerox Error Code List Phaser 8560 A to Z list of all products. Which driver do I need to install?. Downloads | Documentation. Xerox Travel Scanner 150. Phaser 8560 MFP. Self Help | Drivers. Windows 2008 Server Manager Snap In Error Aug 31, 2012. We got the error “MMC could not create the snap-in. The snap-in might not have been installed

libcpmtd.lib(locale.obj) : error LNK2001: unresolved external symbol "void. external symbol _strtol referenced in function "public: static long.

Learn, Share, Build. Each month, over 50 million developers come to Stack Overflow to learn, share their knowledge, and build their careers. Join the world's.

Hi Pavel, Thank you for acknowledging my Windows port of MPFR. I run all the mpfr C++ wrappers and I tried yours out today. The only problem I had is that you don’t.

Schoolchildren from Caversham have become the first to learn a brand new theory that dividing by zero is possible using a new number – ‘nullity’. But the suggestion has left many mathematicians cold.

. error LNK2019: unresolved external symbol. error LNK2001: unresolved external symbol. This lnk2019 error i am getting is from a function in.

What is the difference between a template class and a class template? What is the difference between a template function and a function template?

The latest version of this topic can be found at Linker Tools Error LNK2019. unresolved. the external symbol for every function. A symbol is defined as static.

So companies like Osterhout Design Group have popped up to work as a go-between and the DIUx functions as a sort of semi-hands off VC. Advertisement All-in-all, the program doesn’t seem like it’s been going so well. Carter has.

Centuries ago, from 2007 to 2016, the hot attraction was the escape room, a sort of real-life game of Myst where you solved puzzles to get out of a dungeon or library or steampunk laboratory. But it’s 2017, and it isn’t time for cerebral.

when calling function from a static. error-lnk2001-unresolved-external-symbol-void. error LNK2001: unresolved external symbol.

1>include_juce_graphics.obj : error LNK2019: unresolved external symbol. external symbol wcslen referenced in function "private: static void.

I’ve downloaded this C++ code from the SBIG website in order to control (take pictures and save them) the camera (model ST-401ME) which I purchased from them. I have.

dcmdata.lib(dcuid.obj) : error LNK2019: unresolved external symbol [email protected] LNK2019: unresolved external symbol [email protected] referenced in function. Do you build shared libraries (option in cmake) or static ?

5>aptrte.obj : error LNK2019: unresolved external symbol "public: static. in function "public: static void __cdecl Standard_Transient::operator.

Qt – Unresolved externals, again – C++ Forum – Sep 20, 2012  · I keep getting unresolved externals when I change code that uses Qt in VC++ There is no actual code missing, it relates to the generated code. If I delete the.

Symantec Error 1609 CBS News wrote August 10, 2016 about “…the hackers at Symantec Security Response” who demonstrated. compared to exit poll results were significantly outside the margin of error in 12 of 26 states. Charnin concluded that. Jul 26, 2006. 1259: This error code only occurs when using Windows Installer version 2.0. 1609: An error occurred while

Oct 2, 2012. So now I have to try and build the static libraries for use in Visual Studio. error LNK2001: unresolved external symbol _gfortran_st_write.

c++ – unresolved external symbol when accessing a static. – unresolved external symbol when accessing a static variable. error LNK2001: unresolved external symbol "public:. Unresolved external symbol on static class.

RECOMMENDED: Click here to fix Windows errors and improve system performance