Error Bc30289

RECOMMENDED: If you have Windows errors then we strongly recommend that you download and run this (Windows) Repair Tool.

VB Function to return records based on a date parameter. – Another question sourced from this tricky environment and my inexperience. It seems like VB Functions are the only way I can deliver on some of these report requirements.

Extracting Date from a String. Ask Question. up vote 1 down vote favorite. I have a string such as "5/12/2014 1:14:50 PM" and I am trying to extract the date.

asp.net – Error converting from a.htm to.aspx file – Stack Overflow – Jul 7, 2011. Assuming your vbscript is meant to be client-side, the change to.aspx might be running the vbscript as server code instead of client-side code.

inline task and VBS language. C:\ Users\me\AppData\Local\Temp\2\y5nlhqqy.0.vb(43,0) : error BC30289: State ment cannot appear within a method body.

Cc1plus Error Unrecognized Command Line Option – Arch When I try to configure with this command:. sse2.o sse2.cpp cc1plus: error: unrecognized command line option '-msse2' make: *** [sse2.o]. mkspecs/linux- g++ -I. -o arch.o arch.cpp g++ -o arch arch.o Found architecture in. libbrotli – meta project to build libraries from the brotli source code Aug 7, 2013. mkspecs/linux-g++ -I. -o arch.o arch.cpp g++ -o

in like you said, but it started saying "statement cannot appear within a method body. End of method assumed." again. dont i have to change

Using Custom Code Functions in Reporting Services Reports | Paul. – Oct 10, 2011. My question is can i hide this error and show any custom message when user. BC30289 Statement cannot appear within a method body.

<message> This error could also be due to mixing a file reference to '<filename1 >' in project '<projectname1>' with a file reference to '<filename2>' in project.

Db Function Failed With Error Number 1053 How know how corect it? jtablesession::Store Failed DB function failed with error number 1054 Unknown column 'client_id' in 'field list' SQL. The database didn’t. 8:47:40 InnoDB: Error: Write to file./ibdata1 failed at offset 11 2854223872. InnoDB: 1048576 bytes should have been written, only 0 were. 1053: The service did not respond to the start or

rsUnexpectedCompilerError An unexpected error occurred while compiling expressions. Native compiler return value [BC30179].

RECOMMENDED: Click here to fix Windows errors and improve system performance