Conftest C Error

RECOMMENDED: If you have Windows errors then we strongly recommend that you download and run this (Windows) Repair Tool.

Make All Error 1 Error-prone Tigresses miss out on chance to make history – University of Santo Tomas was on its way to make history, knock Ateneo out of the Shakey’s V-League. With their semifinal series tied at 1-1, all the Tigresses had to do was take Game 3 from the Lady Eagles. That, however, did not. Frequently Asked

Feb 23, 2013. The problem may well be that the GNU make implicit variable that denotes "your C++ compiler" is not CPP but CXX , whereas CPP is the.

Unexpected Sw Error Occurred While Processing Identity Protection Main Mode Unexpected Sw Error Occurred While Processing Identity Protection Main Mode. We'll let you know when not specified by peer). Wait for a 1 times. By submitting you. *Automatically* Fix Unexpected Error. 100% Guaranteed, Download Now. Cisco VPN client with Microsoft CA server certificate unable to connect to. peer ID type 9 received. Unexpected SW error
Java.sql.sqlexception Function Sequence Error java.sql.SQLException. not exist Error Code: 942 Call:UPDATE SEQUENCE SET SEQ_COUNT = SEQ_COUNT + 1. sequencing.Sequence.getGeneratedVector(Sequence.java. Dec 4, 2016. According to JDBC documentation (http://docs.oracle.com/javase/7/docs/api/java/ sql/ResultSet.html) calls to isLast() and first() methods are. Sorry I am new to SQLPlus stuffs! So here, I have a table called iowe, i have a four records pre-loaded into it. This

Wireshark – Hi, I get: capture-pcap-util.c:620: error: static declaration of ‘pcap_datalink_name_to. 49170: gcc -std=gnu99 -o conftest -I/usr/include/pcap -Wall -Wextra -Wendif-labels -Wpointer-arith -Wformat-security -fwrapv -fno-strict-overflow -fno.

autotools – Autoconf problem: "error: C compiler cannot. – I'm trying to build a program I've written in C using GNU autotools, but I evidently have it set up wrong because when configure runs, it spits out: configure: error.

Copyright (C) 1996-1999 Free Software Foundation. interface so that the package installer could choose what sort of libraries were built. GNU Libtool simplifies the developer’s job by encapsulating both the platform-specific.

compile – GCC 4.8.1 failed complilation – Super User – This is the error message: checking for x86_64-unknown-linux-gnu-gcc. configure:5876: gcc -o conftest -g -O2 conftest.c -lisl >&5 conftest.c:10:25:.

Simple Screen Recorder is a fantastic piece of software that was initially developed by its author to record output of programs and games.

Aug 11, 2016 · configure: error: C preprocessor fails sanity check. identifier "Syntax" is undefined Syntax error ^ conftest.c(14): error: expected a ";.

Nov 30, 2008. You may receive the above error in the mkmf.log file when attempting to install the MySQL gem. A sample of the log file errors is below.

I recently installed CodeBlocks with mingw32 on Windows 7 Ultimate 32bit in order to dust off my c skills, but this problem has me somewhat stumped. I decided to fire.

When I try to./configure some programs (but not all), I keep running into the same conftest errors. An example (FLTK 1.1.5rc1):.

conftest.c:1:19: error: mysql.h: No such file or directory | Question Defense

Hi I am building prelink and for this I first built elfutils-0.153 package. Now, when i try to configure prelink with command :./configure CPPFLAGS=&q

Oh building in the source directory is not really supported. Can you try building in a different object directory?

I still get this error whenever trying to compile anything. file name configure: 3217: gcc conftest.c >&5 gcc: error trying to exec 'cc1': execvp: No.

RECOMMENDED: Click here to fix Windows errors and improve system performance